{"text_format":"3","workbook":"xlsx","n_sheets":2,"sheets":["BVNW Meldeliste Land","Daten"],"not_rendered":{"defined_names":1},"read":"whole","date_system":"1900"}

{"sheet":"BVNW Meldeliste Land","index":0,"n_rows":145,"n_cols":10,"rows_kept":145,"merged":[[0,2,0,3],[1,2,1,3],[2,2,2,3],[3,4,3,8],[5,1,5,3],[5,4,5,8],[7,1,7,3],[7,4,7,8],[9,1,9,3],[9,4,9,8],[11,1,11,3],[11,4,11,8],[47,1,47,7]]}
[null,"Anmeldung zur:","Landesmeisterschaft BVNW",null,2023]
[null,null,"DBSV Waldrunde"]
[]
[null,"Datum:","2023-07-09","Ort:","38315 Hornburg, Hasenwinkelgrund 2a,  (NI)"]
[]
[null,"Gesamte Teilnehmerliste des Bogensportvereins:"]
[]
[null,"vollst. Anschrift des Bogensportvereins eintragen:"]
[]
[null,"vollst.  Name des/der Anmelders/in eintragen:"]
[]
[null,"E-Mail des/der Anmelders/in:"]
[]
["Lfd\nNr.","Name\n\nz.B. Mustermann","Vorname\n\nMax","Jahrgang\n\n1999","Altersklasse\n\nHerren Ü50","Bogenart\n\nRC","Mitgliedsnummer im DBSV\n10/999/99999","m\n/\nw"]
[1,{"$nulls":8},{"$f":"IF($H15=\"m\",VLOOKUP($E$1-$D$15,Daten!$E$3:$G$95,2,FALSE),VLOOKUP($E$1-$D15,Daten!$E$3:$G$95,3,FALSE))","v":{"$error":"#N/A"}}]
[{"$f":"IF(ISTEXT(B15),A15+1,\"\")","v":""},{"$nulls":8},{"$f":"IF($H16=\"m\",VLOOKUP($E$1-$D$15,Daten!$E$3:$G$95,2,FALSE),VLOOKUP($E$1-$D16,Daten!$E$3:$G$95,3,FALSE))","v":{"$error":"#N/A"}}]
["",{"$nulls":8},{"$f":"IF($H17=\"m\",VLOOKUP($E$1-$D$15,Daten!$E$3:$G$95,2,FALSE),VLOOKUP($E$1-$D17,Daten!$E$3:$G$95,3,FALSE))","v":{"$error":"#N/A"}}]
["",{"$nulls":8},{"$f":"IF($H18=\"m\",VLOOKUP($E$1-$D$15,Daten!$E$3:$G$95,2,FALSE),VLOOKUP($E$1-$D18,Daten!$E$3:$G$95,3,FALSE))","v":{"$error":"#N/A"}}]
["",{"$nulls":8},{"$f":"IF($H19=\"m\",VLOOKUP($E$1-$D$15,Daten!$E$3:$G$95,2,FALSE),VLOOKUP($E$1-$D19,Daten!$E$3:$G$95,3,FALSE))","v":{"$error":"#N/A"}}]
["",{"$nulls":8},{"$f":"IF($H20=\"m\",VLOOKUP($E$1-$D$15,Daten!$E$3:$G$95,2,FALSE),VLOOKUP($E$1-$D20,Daten!$E$3:$G$95,3,FALSE))","v":{"$error":"#N/A"}}]
["",{"$nulls":8},{"$f":"IF($H21=\"m\",VLOOKUP($E$1-$D$15,Daten!$E$3:$G$95,2,FALSE),VLOOKUP($E$1-$D21,Daten!$E$3:$G$95,3,FALSE))","v":{"$error":"#N/A"}}]
["",{"$nulls":8},{"$f":"IF($H22=\"m\",VLOOKUP($E$1-$D$15,Daten!$E$3:$G$95,2,FALSE),VLOOKUP($E$1-$D22,Daten!$E$3:$G$95,3,FALSE))","v":{"$error":"#N/A"}}]
["",{"$nulls":8},{"$f":"IF($H23=\"m\",VLOOKUP($E$1-$D$15,Daten!$E$3:$G$95,2,FALSE),VLOOKUP($E$1-$D23,Daten!$E$3:$G$95,3,FALSE))","v":{"$error":"#N/A"}}]
["",{"$nulls":8},{"$f":"IF($H24=\"m\",VLOOKUP($E$1-$D$15,Daten!$E$3:$G$95,2,FALSE),VLOOKUP($E$1-$D24,Daten!$E$3:$G$95,3,FALSE))","v":{"$error":"#N/A"}}]
["",{"$nulls":8},{"$f":"IF($H25=\"m\",VLOOKUP($E$1-$D$15,Daten!$E$3:$G$95,2,FALSE),VLOOKUP($E$1-$D25,Daten!$E$3:$G$95,3,FALSE))","v":{"$error":"#N/A"}}]
["",{"$nulls":8},{"$f":"IF($H26=\"m\",VLOOKUP($E$1-$D$15,Daten!$E$3:$G$95,2,FALSE),VLOOKUP($E$1-$D26,Daten!$E$3:$G$95,3,FALSE))","v":{"$error":"#N/A"}}]
["",{"$nulls":8},{"$f":"IF($H27=\"m\",VLOOKUP($E$1-$D$15,Daten!$E$3:$G$95,2,FALSE),VLOOKUP($E$1-$D27,Daten!$E$3:$G$95,3,FALSE))","v":{"$error":"#N/A"}}]
["",{"$nulls":8},{"$f":"IF($H28=\"m\",VLOOKUP($E$1-$D$15,Daten!$E$3:$G$95,2,FALSE),VLOOKUP($E$1-$D28,Daten!$E$3:$G$95,3,FALSE))","v":{"$error":"#N/A"}}]
["",{"$nulls":8},{"$f":"IF($H29=\"m\",VLOOKUP($E$1-$D$15,Daten!$E$3:$G$95,2,FALSE),VLOOKUP($E$1-$D29,Daten!$E$3:$G$95,3,FALSE))","v":{"$error":"#N/A"}}]
["",{"$nulls":8},{"$f":"IF($H30=\"m\",VLOOKUP($E$1-$D$15,Daten!$E$3:$G$95,2,FALSE),VLOOKUP($E$1-$D30,Daten!$E$3:$G$95,3,FALSE))","v":{"$error":"#N/A"}}]
["",{"$nulls":8},{"$f":"IF($H31=\"m\",VLOOKUP($E$1-$D$15,Daten!$E$3:$G$95,2,FALSE),VLOOKUP($E$1-$D31,Daten!$E$3:$G$95,3,FALSE))","v":{"$error":"#N/A"}}]
["",{"$nulls":8},{"$f":"IF($H32=\"m\",VLOOKUP($E$1-$D$15,Daten!$E$3:$G$95,2,FALSE),VLOOKUP($E$1-$D32,Daten!$E$3:$G$95,3,FALSE))","v":{"$error":"#N/A"}}]
["",{"$nulls":8},{"$f":"IF($H33=\"m\",VLOOKUP($E$1-$D$15,Daten!$E$3:$G$95,2,FALSE),VLOOKUP($E$1-$D33,Daten!$E$3:$G$95,3,FALSE))","v":{"$error":"#N/A"}}]
["",{"$nulls":8},{"$f":"IF($H34=\"m\",VLOOKUP($E$1-$D$15,Daten!$E$3:$G$95,2,FALSE),VLOOKUP($E$1-$D34,Daten!$E$3:$G$95,3,FALSE))","v":{"$error":"#N/A"}}]
["",{"$nulls":8},{"$f":"IF($H35=\"m\",VLOOKUP($E$1-$D$15,Daten!$E$3:$G$95,2,FALSE),VLOOKUP($E$1-$D35,Daten!$E$3:$G$95,3,FALSE))","v":{"$error":"#N/A"}}]
["",{"$nulls":8},{"$f":"IF($H36=\"m\",VLOOKUP($E$1-$D$15,Daten!$E$3:$G$95,2,FALSE),VLOOKUP($E$1-$D36,Daten!$E$3:$G$95,3,FALSE))","v":{"$error":"#N/A"}}]
["",{"$nulls":8},{"$f":"IF($H37=\"m\",VLOOKUP($E$1-$D$15,Daten!$E$3:$G$95,2,FALSE),VLOOKUP($E$1-$D37,Daten!$E$3:$G$95,3,FALSE))","v":{"$error":"#N/A"}}]
["",{"$nulls":8},{"$f":"IF($H38=\"m\",VLOOKUP($E$1-$D$15,Daten!$E$3:$G$95,2,FALSE),VLOOKUP($E$1-$D38,Daten!$E$3:$G$95,3,FALSE))","v":{"$error":"#N/A"}}]
["",{"$nulls":8},{"$f":"IF($H39=\"m\",VLOOKUP($E$1-$D$15,Daten!$E$3:$G$95,2,FALSE),VLOOKUP($E$1-$D39,Daten!$E$3:$G$95,3,FALSE))","v":{"$error":"#N/A"}}]
["",{"$nulls":8},{"$f":"IF($H40=\"m\",VLOOKUP($E$1-$D$15,Daten!$E$3:$G$95,2,FALSE),VLOOKUP($E$1-$D40,Daten!$E$3:$G$95,3,FALSE))","v":{"$error":"#N/A"}}]
["",{"$nulls":8},{"$f":"IF($H41=\"m\",VLOOKUP($E$1-$D$15,Daten!$E$3:$G$95,2,FALSE),VLOOKUP($E$1-$D41,Daten!$E$3:$G$95,3,FALSE))","v":{"$error":"#N/A"}}]
["",{"$nulls":8},{"$f":"IF($H42=\"m\",VLOOKUP($E$1-$D$15,Daten!$E$3:$G$95,2,FALSE),VLOOKUP($E$1-$D42,Daten!$E$3:$G$95,3,FALSE))","v":{"$error":"#N/A"}}]
["",{"$nulls":8},{"$f":"IF($H43=\"m\",VLOOKUP($E$1-$D$15,Daten!$E$3:$G$95,2,FALSE),VLOOKUP($E$1-$D43,Daten!$E$3:$G$95,3,FALSE))","v":{"$error":"#N/A"}}]
["",{"$nulls":8},{"$f":"IF($H44=\"m\",VLOOKUP($E$1-$D$15,Daten!$E$3:$G$95,2,FALSE),VLOOKUP($E$1-$D44,Daten!$E$3:$G$95,3,FALSE))","v":{"$error":"#N/A"}}]
["",{"$nulls":8},{"$f":"IF($H45=\"m\",VLOOKUP($E$1-$D$15,Daten!$E$3:$G$95,2,FALSE),VLOOKUP($E$1-$D45,Daten!$E$3:$G$95,3,FALSE))","v":{"$error":"#N/A"}}]
[]
[null,"Bemerkungen:"]
[null,"Text eingeben:"]
{"$rows_empty":26}
[{"$f":"IF(ISTEXT(B74),A74+1,\"\")","v":""}]
[""]
[""]
[""]
[""]
[{"$f":"IF(ISTEXT(B79),A79+1,\"\")","v":""}]
[""]
[""]
[""]
[""]
[""]
[""]
[""]
[""]
[""]
[""]
[""]
[""]
[""]
[""]
[""]
[""]
[""]
[""]
[""]
[""]
[""]
[""]
[""]
[""]
[""]
[""]
[""]
[""]
[""]
[""]
[""]
[{"$f":"IF(ISTEXT(B111),A111+1,\"\")","v":""}]
[""]
[""]
[""]
[""]
[""]
[""]
[""]
[""]
[""]
[""]
[""]
[""]
[""]
[""]
[""]
[""]
[""]
[""]
[""]
[""]
[""]
[""]
[""]
[""]
[""]
[""]
[""]
[""]
[""]
[""]
[""]
[""]
[""]

{"sheet":"Daten","index":1,"n_rows":95,"n_cols":7,"rows_kept":95,"hidden":true,"merged":[[0,4,0,6]]}
["Landesmeisterschaft:","Bezirke:","Bogenklassen:","Altersklassen:","Altersklassen"]
["*** auswählen ***","1 & 2","RC","U10m","Alter","männlich","weiblich"]
["DBSV Hallenrunde","3 & 4","CU","U10w",8,"U10m","U10w"]
["DBSV Runde im Freien",5,"CB","U12m",9,"U10m","U10w"]
["DBSV 3D-Runde",6,"BB","U12w",10,"U10m","U10w"]
["DBSV Feldrunde",7,"JB","U15m",11,"U12m","U12w"]
["DBSV Waldrunde",null,"LB","U15w",12,"U12m","U12w"]
[null,null,"PB","U18m",13,"U15m","U15w"]
[null,null,"KB","U18w",14,"U15m","U15w"]
[{"$nulls":3},"Damen",15,"U15m","U15w"]
[{"$nulls":3},"Herren",16,"U18m","U18w"]
[{"$nulls":3},"Damen Ü50",17,"U18m","U18w"]
[{"$nulls":3},"Herren Ü50",18,"U18m","U18w"]
[{"$nulls":3},"Damen Ü65",19,"Herren","Damen"]
[{"$nulls":3},"Herren Ü65",20,"Herren","Damen"]
[{"$nulls":4},21,"Herren","Damen"]
[{"$nulls":4},22,"Herren","Damen"]
[{"$nulls":4},23,"Herren","Damen"]
[{"$nulls":4},24,"Herren","Damen"]
[{"$nulls":4},25,"Herren","Damen"]
[{"$nulls":4},26,"Herren","Damen"]
[{"$nulls":4},27,"Herren","Damen"]
[{"$nulls":4},28,"Herren","Damen"]
[{"$nulls":4},29,"Herren","Damen"]
[{"$nulls":4},30,"Herren","Damen"]
[{"$nulls":4},31,"Herren","Damen"]
[{"$nulls":4},32,"Herren","Damen"]
[{"$nulls":4},33,"Herren","Damen"]
[{"$nulls":4},34,"Herren","Damen"]
[{"$nulls":4},35,"Herren","Damen"]
[{"$nulls":4},36,"Herren","Damen"]
[{"$nulls":4},37,"Herren","Damen"]
[{"$nulls":4},38,"Herren","Damen"]
[{"$nulls":4},39,"Herren","Damen"]
[{"$nulls":4},40,"Herren","Damen"]
[{"$nulls":4},41,"Herren","Damen"]
[{"$nulls":4},42,"Herren","Damen"]
[{"$nulls":4},43,"Herren","Damen"]
[{"$nulls":4},44,"Herren","Damen"]
[{"$nulls":4},45,"Herren","Damen"]
[{"$nulls":4},46,"Herren","Damen"]
[{"$nulls":4},47,"Herren","Damen"]
[{"$nulls":4},48,"Herren","Damen"]
[{"$nulls":4},49,"Herren","Damen"]
[{"$nulls":4},50,"Herren","Damen"]
[{"$nulls":4},51,"Herren Ü50","Damen Ü50"]
[{"$nulls":4},52,"Herren Ü50","Damen Ü50"]
[{"$nulls":4},53,"Herren Ü50","Damen Ü50"]
[{"$nulls":4},54,"Herren Ü50","Damen Ü50"]
[{"$nulls":4},55,"Herren Ü50","Damen Ü50"]
[{"$nulls":4},56,"Herren Ü50","Damen Ü50"]
[{"$nulls":4},57,"Herren Ü50","Damen Ü50"]
[{"$nulls":4},58,"Herren Ü50","Damen Ü50"]
[{"$nulls":4},59,"Herren Ü50","Damen Ü50"]
[{"$nulls":4},60,"Herren Ü50","Damen Ü51"]
[{"$nulls":4},61,"Herren Ü50","Damen Ü52"]
[{"$nulls":4},62,"Herren Ü50","Damen Ü53"]
[{"$nulls":4},63,"Herren Ü50","Damen Ü54"]
[{"$nulls":4},64,"Herren Ü50","Damen Ü55"]
[{"$nulls":4},65,"Herren Ü50","Damen Ü56"]
[{"$nulls":4},66,"Herren Ü65","Damen Ü65"]
[{"$nulls":4},67,"Herren Ü65","Damen Ü65"]
[{"$nulls":4},68,"Herren Ü65","Damen Ü65"]
[{"$nulls":4},69,"Herren Ü65","Damen Ü65"]
[{"$nulls":4},70,"Herren Ü65","Damen Ü65"]
[{"$nulls":4},71,"Herren Ü65","Damen Ü65"]
[{"$nulls":4},72,"Herren Ü65","Damen Ü65"]
[{"$nulls":4},73,"Herren Ü65","Damen Ü65"]
[{"$nulls":4},74,"Herren Ü65","Damen Ü65"]
[{"$nulls":4},75,"Herren Ü65","Damen Ü65"]
[{"$nulls":4},76,"Herren Ü65","Damen Ü65"]
[{"$nulls":4},77,"Herren Ü65","Damen Ü65"]
[{"$nulls":4},78,"Herren Ü65","Damen Ü65"]
[{"$nulls":4},79,"Herren Ü65","Damen Ü65"]
[{"$nulls":4},80,"Herren Ü65","Damen Ü65"]
[{"$nulls":4},81,"Herren Ü65","Damen Ü65"]
[{"$nulls":4},82,"Herren Ü65","Damen Ü65"]
[{"$nulls":4},83,"Herren Ü65","Damen Ü65"]
[{"$nulls":4},84,"Herren Ü65","Damen Ü65"]
[{"$nulls":4},85,"Herren Ü65","Damen Ü65"]
[{"$nulls":4},86,"Herren Ü65","Damen Ü65"]
[{"$nulls":4},87,"Herren Ü65","Damen Ü65"]
[{"$nulls":4},88,"Herren Ü65","Damen Ü65"]
[{"$nulls":4},89,"Herren Ü65","Damen Ü65"]
[{"$nulls":4},90,"Herren Ü65","Damen Ü65"]
[{"$nulls":4},91,"Herren Ü65","Damen Ü65"]
[{"$nulls":4},92,"Herren Ü65","Damen Ü65"]
[{"$nulls":4},93,"Herren Ü65","Damen Ü65"]
[{"$nulls":4},94,"Herren Ü65","Damen Ü65"]
[{"$nulls":4},95,"Herren Ü65","Damen Ü65"]
[{"$nulls":4},96,"Herren Ü65","Damen Ü65"]
[{"$nulls":4},97,"Herren Ü65","Damen Ü65"]
[{"$nulls":4},98,"Herren Ü65","Damen Ü65"]
[{"$nulls":4},99,"Herren Ü65","Damen Ü65"]
[{"$nulls":4},100,"Herren Ü65","Damen Ü65"]